Target
Low molecular weight phosphotyrosine protein phosphatase
Ligand
BDBM50188784
Substrate
Meas. Tech.
ChEMBL_389280 (CHEMBL868036)
IC50
7700±n/a nM
Citation
 Amarasinghe, KKEvdokimov, AGEvidokimov, AGXu, KClark, CMMaier, MBSrivastava, AColson, AOGerwe, GSStake, GEHoward, BWPokross, MEGray, JLPeters, KG Design and synthesis of potent, non-peptidic inhibitors of HPTPbeta. Bioorg Med Chem Lett 16:4252-6 (2006)  
Target
Name:
Low molecular weight phosphotyrosine protein phosphatase
Synonyms:
3.1.3.2 ACP1 LMW-PTP LMWPTP PPAC_HUMAN low molecular weight phosphotyrosine protein phosphatase isoform c
Type:
Mol. Mass.:
18042.81
Organism:
Homo sapiens (Human)
Description:
P24666
Residue:
158
  
Inhibitor
Name:
BDBM50188784
Synonyms:
CHEMBL385251 | ammonium N-{4-[3-methoxy-2-(methoxycarbonyl)-3-oxo-2-(3-phenylpropyl)propyl]phenyl}sulfamate
Type:
Small organic molecule
Emp. Form.:
C21H24NO7S
Mol. Mass.:
434.483
SMILES:
COC(=O)C(CCCc1ccccc1)(Cc1ccc(NS([O-])(=O)=O)cc1)C(=O)OC
: