Target
72 kDa type IV collagenase
Ligand
BDBM50606395
Substrate
Meas. Tech.
ChEMBL_2254619 (CHEMBL5168829)
IC50
0.051000±n/a nM
Citation
 Takeuchi, THayashi, MTamita, TNomura, YKojima, NMitani, ATakeda, THitaka, KKato, YKamitani, MMima, MToki, HOhkubo, MNozoe, AKakinuma, H Discovery of Aryloxyphenyl-Heptapeptide Hybrids as Potent and Selective Matrix Metalloproteinase-2 Inhibitors for the Treatment of Idiopathic Pulmonary Fibrosis. J Med Chem 65:8493-8510 (2022) Target
Name:
72 kDa type IV collagenase
Synonyms:
72 kDa gelatinase CLG4A Gelatinase A (MMP-2) MMP2_HUMAN Matrix metalloproteinase-2 (MMP 2) Matrix metalloproteinases 2 (MMP-2) | TBE-1
Type:
Enzyme
Mol. Mass.:
73870.36
Organism:
Homo sapiens (Human)
Description:
P08253
Residue:
660
  
Inhibitor
Name:
BDBM50606395
Synonyms:
CHEMBL5207094
Type:
Small organic molecule
Emp. Form.:
C49H69N11O15
Mol. Mass.:
1052.1369
SMILES:
CC(C)C[C@H](NC(=O)[C@H](CCN)NC(=O)[C@H](CC(O)=O)NC(=O)[C@H](CC(N)=O)NC(=O)CCCCNC(=O)c1ccc(Oc2ccc(cc2)C(N)=O)cc1)C(=O)N(C)[C@@H](CCC(O)=O)C(=O)N1CCC[C@H]1CC(N)=O
: