Target
C-X-C chemokine receptor type 1
Ligand
BDBM50236053
Substrate
Meas. Tech.
ChEMBL_2260010 (CHEMBL5215021)
IC50
6.8±n/a nM
Citation
 Chasák, J?lachtová, VUrban, MBrulíková, L Squaric acid analogues in medicinal chemistry. Eur J Med Chem 209:0 (2021) Target
Name:
C-X-C chemokine receptor type 1
Synonyms:
C-X-C chemokine receptor type 1 (CXCR-1) CMKAR1 CXCR1_HUMAN Interleukin-8 receptor A | Interleukin-8 receptors, CXCR1/CXCR2
Type:
Enzyme
Mol. Mass.:
39803.83
Organism:
Homo sapiens (Human)
Description:
P25024
Residue:
350
  
Inhibitor
Name:
BDBM50236053
Synonyms:
(R)-3-(3,4-dioxo-2-(1-phenylpropylamino)cyclobut-1-enylamino)-2-hydroxy-N,N-dimethylbenzamide | CHEMBL254370
Type:
Small organic molecule
Emp. Form.:
C22H23N3O4
Mol. Mass.:
393.4357
SMILES:
CC[C@@H](Nc1c(Nc2cccc(C(=O)N(C)C)c2O)c(=O)c1=O)c1ccccc1
: