Target
Melanocortin receptor 3
Ligand
BDBM50189021
Substrate
Meas. Tech.
ChEMBL_395995 (CHEMBL910340)
EC50
163±n/a nM
Citation
 Tian, XMishra, RKSwitzer, AGHu, XEKim, NMazur, AWEbetino, FHWos, JACrossdoersen, DPinney, BBFarmer, JASheldon, RJ Design and synthesis of potent and selective 1,3,4-trisubstituted-2-oxopiperazine based melanocortin-4 receptor agonists. Bioorg Med Chem Lett 16:4668-73 (2006)  
Target
Name:
Melanocortin receptor 3
Synonyms:
MC3-R MC3R_HUMAN Melanocortin receptor (M3 and M4)
Type:
Enzyme
Mol. Mass.:
36044.86
Organism:
Homo sapiens (Human)
Description:
P41968
Residue:
323
  
Inhibitor
Name:
BDBM50189021
Synonyms:
CHEMBL215895 | N-((R)-3-(4-fluorophenyl)-1-((S)-2-(3-guanidinopropyl)-4-((S)-1-(methylamino)-3-(naphthalen-2-yl)-1-oxopropan-2-yl)-3-oxopiperazin-1-yl)-1-oxopropan-2-yl)-1,2,3,4-tetrahydroisoquinoline-3-carboxamide
Type:
Small organic molecule
Emp. Form.:
C41H47FN8O4
Mol. Mass.:
734.8615
SMILES:
CNC(=O)[C@H](Cc1ccc2ccccc2c1)N1CCN([C@@H](CCCNC(N)=N)C1=O)C(=O)[C@@H](Cc1ccc(F)cc1)NC(=O)C1Cc2ccccc2CN1
: