Target
Nicotinic acetylcholine receptor alpha9/alpha10
Ligand
BDBM50606636
Substrate
Meas. Tech.
ChEMBL_2260837 (CHEMBL5215848)
IC50
1.5±n/a nM
Citation
 Gajewiak, JChristensen, SBDowell, CHararah, FFisher, FHuynh, PNOlivera, BMMcIntosh, JM Selective Penicillamine Substitution Enables Development of a Potent Analgesic Peptide that Acts through a Non-Opioid-Based Mechanism. J Med Chem 64:9271-9278 (2021) Target
Name:
Nicotinic acetylcholine receptor alpha9/alpha10
Synonyms:
Neuronal acetylcholine receptor subunit alpha-10/alpha-9
Type:
Mol. Mass.:
Description:
ASSAY_ID of ChEMBL is 2193071
Components:
This complex has 2 components.
Component 1
Name:
Neuronal acetylcholine receptor subunit alpha-9
Synonyms:
ACHA9_RAT Cholinergic, Nicotinic Muscle NACHR alpha 9 Nicotinic acetylcholine receptor subunit alpha 9
Type:
Enzyme Catalytic Domain
Mol. Mass.:
54522.69
Organism:
RAT
Description:
Cholinergic, Nicotinic Muscle 0 RAT::P43144
Residue:
479
  
Component 2
Name:
Neuronal acetylcholine receptor subunit alpha-10
Synonyms:
ACH10_RAT Neuronal acetylcholine receptor protein alpha-10 subunit | Nicotinic acetylcholine receptor alpha9/alpha10
Type:
PROTEIN
Mol. Mass.:
49830.54
Organism:
Rattus norvegicus
Description:
ChEMBL_143222
Residue:
447
  
Inhibitor
Name:
BDBM50606636
Synonyms:
CHEMBL5220778
Type:
Small organic molecule
Emp. Form.:
C59H94N24O19S4
Mol. Mass.:
1571.787
SMILES:
[H][C@@]12CCCN1C(=O)[C@H](CC(O)=O)NC(=O)[C@H](CO)NC(=O)[C@@H]1CSSC[C@H](NC(=O)[C@H](CCCNC(N)=N)NC(=O)[C@H](Cc3ccc(O)cc3)NC(=O)[C@H](CCCNC(N)=O)NC(=O)[C@H](CSSC[C@H](NC(=O)CN)C(=O)N1)NC(=O)[C@H](CCCNC(N)=N)NC2=O)C(=O)N[C@@H](CCCNC(N)=N)C(O)=O
: