Target
Angiotensin-converting enzyme
Ligand
BDBM50189454
Substrate
Meas. Tech.
ChEMBL_405414 (CHEMBL866171)
Ki
26300±n/a nM
Citation
 Nchinda, ATChibale, KRedelinghuys, PSturrock, ED Synthesis and molecular modeling of a lisinopril-tryptophan analogue inhibitor of angiotensin I-converting enzyme. Bioorg Med Chem Lett 16:4616-9 (2006)  
Target
Name:
Angiotensin-converting enzyme
Synonyms:
ACE Angiotensin converting enzyme (ACE) Angiotensin-converting enzyme, soluble form CD_antigen=CD143 DCP1 Kininase II
Type:
Enzyme
Mol. Mass.:
149709.01
Organism:
Homo sapiens (Human)
Description:
Residue:
1306
  
Inhibitor
Name:
BDBM50189454
Synonyms:
(R)-2-((S)-6-amino-1-((S)-1-carboxy-2-(1H-indol-3-yl)ethylamino)-1-oxohexan-2-ylamino)-4-phenylbutanoic acid | CHEMBL212711
Type:
Small organic molecule
Emp. Form.:
C27H34N4O5
Mol. Mass.:
494.5827
SMILES:
NCCCC[C@H](N[C@H](CCc1ccccc1)C(O)=O)C(=O)N[C@@H](Cc1c[nH]c2ccccc12)C(O)=O
: