Target
Angiotensin-converting enzyme
Ligand
BDBM50027344
Substrate
Meas. Tech.
ChEMBL_405833 (CHEMBL869865)
Ki
45200±n/a nM
Citation
 Nchinda, ATChibale, KRedelinghuys, PSturrock, ED Synthesis of novel keto-ACE analogues as domain-selective angiotensin I-converting enzyme inhibitors. Bioorg Med Chem Lett 16:4612-5 (2006)  
Target
Name:
Angiotensin-converting enzyme
Synonyms:
ACE Angiotensin converting enzyme (ACE) Angiotensin-converting enzyme, soluble form CD_antigen=CD143 DCP1 Kininase II
Type:
Enzyme
Mol. Mass.:
149709.01
Organism:
Homo sapiens (Human)
Description:
Residue:
1306
  
Inhibitor
Name:
BDBM50027344
Synonyms:
(S)-1-((S)-5-benzamido-4-oxo-6-phenylhexanoyl)pyrrolidine-2-carboxylic acid CHEMBL435360
Type:
Small organic molecule
Emp. Form.:
C24H26N2O5
Mol. Mass.:
422.4736
SMILES:
OC(=O)[C@@H]1CCCN1C(=O)CCC(=O)[C@H](Cc1ccccc1)NC(=O)c1ccccc1
: