Target
Cholinesterase
Ligand
BDBM50312803
Substrate
Meas. Tech.
ChEMBL_2261347 (CHEMBL5216358)
IC50
6.0±n/a nM
Citation
 Zhang, HWang, YWang, YLi, XWang, SWang, Z Recent advance on carbamate-based cholinesterase inhibitors as potential multifunctional agents against Alzheimer's disease. Eur J Med Chem 240:0 (2022) Target
Name:
Cholinesterase
Synonyms:
Acylcholine acylhydrolase Butyrylcholine esterase (BChE) Butyrylcholinesterase (BuChE) CHLE_HUMAN Cholinesterases Pseudocholinesterase
Type:
Homotetramer
Mol. Mass.:
68422.27
Organism:
Homo sapiens (Human)
Description:
P06276
Residue:
602
  
Inhibitor
Name:
BDBM50312803
Synonyms:
(3aS,8aR)-3a,8-dimethyl-1-phenethyl-1,2,3,3a,8,8a-hexahydropyrrolo[2,3-b]indol-5-yl 4-isopropylphenylcarbamate CHEMBL1080386
Type:
Small organic molecule
Emp. Form.:
C30H35N3O2
Mol. Mass.:
469.6178
SMILES:
CC(C)c1ccc(NC(=O)Oc2ccc3N(C)[C@H]4N(CCc5ccccc5)CC[C@@]4(C)c3c2)cc1
: