Target
Sodium-dependent serotonin transporter
Ligand
BDBM50529312
Substrate
Meas. Tech.
ChEMBL_2262315 (CHEMBL5217326)
IC50
0.500000±n/a nM
Citation
 Yuan, RXJiang, KYWu, JWZhang, ZXLi, MSLi, JQNi, F Synthesis and antidepressant activity of novel 1-(1-benzoylpiperidin-4-yl) methanamine derivatives selectively targeting SSRI/5-HT Bioorg Med Chem Lett 76:0 (2022) Target
Name:
Sodium-dependent serotonin transporter
Synonyms:
5-HT Transporter 5HT transporter Anandamid membrane transporter, AMT Monoamine transporters; Norepinephrine & serotonin Slc6a4 Sodium-dependent serotonin transporter (SERT) | imipramine receptor
Type:
Multi-pass membrane protein
Mol. Mass.:
70168.43
Organism:
Rattus norvegicus (rat)
Description:
P31652
Residue:
630
  
Inhibitor
Name:
BDBM50529312
Synonyms:
CHEMBL4444213
Type:
Small organic molecule
Emp. Form.:
C27H26F2N2O
Mol. Mass.:
432.5049
SMILES:
Fc1ccc(OCCN2CCC(CC2)c2c[nH]c3ccc(F)cc23)c(c1)-c1ccccc1
: