Target
Malonyl-CoA decarboxylase, mitochondrial
Ligand
BDBM50190399
Substrate
Meas. Tech.
ChEMBL_375433 (CHEMBL864146)
IC50
7±n/a nM
Citation
 Cheng, JFHuang, YPenuliar, RNishimoto, MLiu, LArrhenius, TYang, GO'leary, EBarbosa, MBarr, RDyck, JRLopaschuk, GDNadzan, AM Discovery of potent and orally available malonyl-CoA decarboxylase inhibitors as cardioprotective agents. J Med Chem 49:4055-8 (2006)  
Target
Name:
Malonyl-CoA decarboxylase, mitochondrial
Synonyms:
DCMC_HUMAN Malonyl-CoA decarboxylase
Type:
PROTEIN
Mol. Mass.:
55018.37
Organism:
Homo sapiens (Human)
Description:
ChEMBL_665404
Residue:
493
  
Inhibitor
Name:
BDBM50190399
Synonyms:
3-{[5-(2,2,2-trifluoro-1-hydroxy-1-trifluoromethyl-ethyl)-4,5-dihydro-isoxazole-3-carbonyl]-amino}-propionic acid 1-ethyl-1-methyl-propyl ester | CHEMBL209108
Type:
Small organic molecule
Emp. Form.:
C16H22F6N2O5
Mol. Mass.:
436.3467
SMILES:
CCC(C)(CC)OC(=O)CCNC(=O)C1=NOC(C1)C(O)(C(F)(F)F)C(F)(F)F
: