Target
Sodium-dependent dopamine transporter
Ligand
BDBM50190605
Substrate
Meas. Tech.
ChEMBL_372237 (CHEMBL853390)
Ki
214±n/a nM
Citation
 Zhang, SFernandez, FHazeldine, SDeschamps, JZhen, JReith, MEDutta, AK Further structural exploration of trisubstituted asymmetric pyran derivatives (2S,4R,5R)-2-benzhydryl-5-benzylamino-tetrahydropyran-4-ol and their corresponding disubstituted (3S,6S) pyran derivatives: a proposed pharmacophore model for high-affinity interaction with the dopamine, serotonin, and no J Med Chem 49:4239-47 (2006)  
Target
Name:
Sodium-dependent dopamine transporter
Synonyms:
DA transporter SC6A3_RAT Sodium-dependent dopamine transporter | Sodium-dependent dopamine transporter (DAT)
Type:
Multi-pass membrane protein
Mol. Mass.:
68749.45
Organism:
Rattus norvegicus (rat)
Description:
P23977
Residue:
619
  
Inhibitor
Name:
BDBM50190605
Synonyms:
CHEMBL209603 | cis-(3S-6S)-(6-benzhydryl-tetrahydropyran-3-yl)-(1H-indol-5-ylmethyl)amine
Type:
Small organic molecule
Emp. Form.:
C27H28N2O
Mol. Mass.:
396.524
SMILES:
C(N[C@H]1CC[C@H](OC1)C(c1ccccc1)c1ccccc1)c1ccc2[nH]ccc2c1
: