Target
Sodium-dependent dopamine transporter
Ligand
BDBM50190604
Substrate
Meas. Tech.
ChEMBL_372237 (CHEMBL853390)
Ki
60±n/a nM
Citation
 Zhang, SFernandez, FHazeldine, SDeschamps, JZhen, JReith, MEDutta, AK Further structural exploration of trisubstituted asymmetric pyran derivatives (2S,4R,5R)-2-benzhydryl-5-benzylamino-tetrahydropyran-4-ol and their corresponding disubstituted (3S,6S) pyran derivatives: a proposed pharmacophore model for high-affinity interaction with the dopamine, serotonin, and no J Med Chem 49:4239-47 (2006)  
Target
Name:
Sodium-dependent dopamine transporter
Synonyms:
DA transporter SC6A3_RAT Sodium-dependent dopamine transporter | Sodium-dependent dopamine transporter (DAT)
Type:
Multi-pass membrane protein
Mol. Mass.:
68749.45
Organism:
Rattus norvegicus (rat)
Description:
P23977
Residue:
619
  
Inhibitor
Name:
BDBM50190604
Synonyms:
CHEMBL209651 | cis-(3R,6R)-(6-benzhydryl-tetrahydropyran-3-yl)-(4-nitrobenzyl)amine
Type:
Small organic molecule
Emp. Form.:
C25H26N2O3
Mol. Mass.:
402.4855
SMILES:
[O-][N+](=O)c1ccc(CN[C@@H]2CC[C@@H](OC2)C(c2ccccc2)c2ccccc2)cc1
: