Target
Sodium-dependent serotonin transporter
Ligand
BDBM50190608
Substrate
Meas. Tech.
ChEMBL_372238 (CHEMBL853391)
Ki
16±n/a nM
Citation
 Zhang, SFernandez, FHazeldine, SDeschamps, JZhen, JReith, MEDutta, AK Further structural exploration of trisubstituted asymmetric pyran derivatives (2S,4R,5R)-2-benzhydryl-5-benzylamino-tetrahydropyran-4-ol and their corresponding disubstituted (3S,6S) pyran derivatives: a proposed pharmacophore model for high-affinity interaction with the dopamine, serotonin, and no J Med Chem 49:4239-47 (2006)  
Target
Name:
Sodium-dependent serotonin transporter
Synonyms:
5-HT Transporter 5HT transporter Anandamid membrane transporter, AMT Monoamine transporters; Norepinephrine & serotonin Slc6a4 Sodium-dependent serotonin transporter (SERT) | imipramine receptor
Type:
Multi-pass membrane protein
Mol. Mass.:
70168.43
Organism:
Rattus norvegicus (rat)
Description:
P31652
Residue:
630
  
Inhibitor
Name:
BDBM50190608
Synonyms:
CHEMBL213627 | cis-(3S,6S)-(6-benzhydryl-tetrahydropyran-3-yl)-(4-aminobenzyl)amine
Type:
Small organic molecule
Emp. Form.:
C25H28N2O
Mol. Mass.:
372.5026
SMILES:
Nc1ccc(CN[C@H]2CC[C@H](OC2)C(c2ccccc2)c2ccccc2)cc1
: