Target
Transporter
Ligand
BDBM50190603
Substrate
Meas. Tech.
ChEMBL_372239 (CHEMBL853393)
Ki
5.1±n/a nM
Citation
 Zhang, SFernandez, FHazeldine, SDeschamps, JZhen, JReith, MEDutta, AK Further structural exploration of trisubstituted asymmetric pyran derivatives (2S,4R,5R)-2-benzhydryl-5-benzylamino-tetrahydropyran-4-ol and their corresponding disubstituted (3S,6S) pyran derivatives: a proposed pharmacophore model for high-affinity interaction with the dopamine, serotonin, and no J Med Chem 49:4239-47 (2006)  
Target
Name:
Transporter
Synonyms:
Monoamine transporters; Norepininephrine & dopamine | Norepinephrine Monoamine transporters
Type:
PROTEIN
Mol. Mass.:
66787.87
Organism:
Rattus norvegicus
Description:
ChEMBL_1463061
Residue:
597
  
Inhibitor
Name:
BDBM50190603
Synonyms:
CHEMBL211077 | cis-(3S,6S)-(6-benzhydryl-tetrahydropyran-3-yl)-(4-hydroxy-benzyl)-amine
Type:
Small organic molecule
Emp. Form.:
C25H27NO2
Mol. Mass.:
373.4874
SMILES:
Oc1ccc(CN[C@H]2CC[C@H](OC2)C(c2ccccc2)c2ccccc2)cc1
: