Target
Transporter
Ligand
BDBM50190599
Substrate
Meas. Tech.
ChEMBL_372239 (CHEMBL853393)
Ki
94±n/a nM
Citation
 Zhang, SFernandez, FHazeldine, SDeschamps, JZhen, JReith, MEDutta, AK Further structural exploration of trisubstituted asymmetric pyran derivatives (2S,4R,5R)-2-benzhydryl-5-benzylamino-tetrahydropyran-4-ol and their corresponding disubstituted (3S,6S) pyran derivatives: a proposed pharmacophore model for high-affinity interaction with the dopamine, serotonin, and no J Med Chem 49:4239-47 (2006)  
Target
Name:
Transporter
Synonyms:
Monoamine transporters; Norepininephrine & dopamine | Norepinephrine Monoamine transporters
Type:
PROTEIN
Mol. Mass.:
66787.87
Organism:
Rattus norvegicus
Description:
ChEMBL_1463061
Residue:
597
  
Inhibitor
Name:
BDBM50190599
Synonyms:
(2R,4S, 5S)-2-benzhydryl-5-(4-hydroxy-benzylamino)-tetrahydro-pyran-4-ol | CHEMBL379706
Type:
Small organic molecule
Emp. Form.:
C25H27NO3
Mol. Mass.:
389.4868
SMILES:
O[C@H]1C[C@@H](OC[C@@H]1NCc1ccc(O)cc1)C(c1ccccc1)c1ccccc1
: