Target
Solute carrier family 15 member 1
Ligand
BDBM50190616
Substrate
Meas. Tech.
ChEMBL_370530 (CHEMBL871421)
Ki
20000±n/a nM
Citation
 Biegel, AGebauer, SBrandsch, MNeubert, KThondorf, I Structural requirements for the substrates of the H+/peptide cotransporter PEPT2 determined by three-dimensional quantitative structure-activity relationship analysis. J Med Chem 49:4286-96 (2006)  
Target
Name:
Solute carrier family 15 member 1
Synonyms:
Intestinal H(+)/peptide cotransporter Oligopeptide transporter, small intestine isoform Peptide transporter 1 SLC15A1
Type:
PROTEIN
Mol. Mass.:
78818.07
Organism:
Homo sapiens (Human)
Description:
ChEMBL_1488839
Residue:
708
  
Inhibitor
Name:
BDBM50190616
Synonyms:
(S)-2-((S)-2-benzamido-3-phenylpropanamido)propanoic acid | CHEMBL214174
Type:
Small organic molecule
Emp. Form.:
C19H20N2O4
Mol. Mass.:
340.3731
SMILES:
C[C@H](NC(=O)[C@H](Cc1ccccc1)NC(=O)c1ccccc1)C(O)=O
: