Target
RNA-directed RNA polymerase
Ligand
BDBM50190964
Substrate
Meas. Tech.
ChEMBL_400597 (CHEMBL853550)
IC50
38±n/a nM
Citation
 Li, HTatlock, JLinton, AGonzalez, JBorchardt, ADragovich, PJewell, TPrins, TZhou, RBlazel, JParge, HLove, RHickey, MDoan, CShi, SDuggal, RLewis, CFuhrman, S Identification and structure-based optimization of novel dihydropyrones as potent HCV RNA polymerase inhibitors. Bioorg Med Chem Lett 16:4834-8 (2006)  
Target
Name:
RNA-directed RNA polymerase
Synonyms:
Hepatitis C virus NS5B RNA-dependent RNA polymerase | NS5B protein
Type:
Protein
Mol. Mass.:
25173.95
Organism:
Hepatitis C virus
Description:
Q8JXU8
Residue:
229
  
Inhibitor
Name:
BDBM50190964
Synonyms:
6-(3-chloro-4-methoxyphenethyl)-6-cyclopentyl-4-hydroxy-3-(4-methyl-4H-1,2,4-triazol-3-ylthio)-5,6-dihydropyran-2-one | CHEMBL215007
Type:
Small organic molecule
Emp. Form.:
C22H26ClN3O4S
Mol. Mass.:
463.978
SMILES:
COc1ccc(CCC2(CC(=O)C(Sc3nncn3C)C(=O)O2)C2CCCC2)cc1Cl
: