Target
RNA-directed RNA polymerase
Ligand
BDBM50190961
Substrate
Meas. Tech.
ChEMBL_400597 (CHEMBL853550)
IC50
>100000±n/a nM
Citation
 Li, HTatlock, JLinton, AGonzalez, JBorchardt, ADragovich, PJewell, TPrins, TZhou, RBlazel, JParge, HLove, RHickey, MDoan, CShi, SDuggal, RLewis, CFuhrman, S Identification and structure-based optimization of novel dihydropyrones as potent HCV RNA polymerase inhibitors. Bioorg Med Chem Lett 16:4834-8 (2006)  
Target
Name:
RNA-directed RNA polymerase
Synonyms:
Hepatitis C virus NS5B RNA-dependent RNA polymerase | NS5B protein
Type:
Protein
Mol. Mass.:
25173.95
Organism:
Hepatitis C virus
Description:
Q8JXU8
Residue:
229
  
Inhibitor
Name:
BDBM50190961
Synonyms:
6-(4-hydroxyphenethyl)-6-methyl-dihydro-3H-pyran-2,4-dione | CHEMBL215350
Type:
Small organic molecule
Emp. Form.:
C14H16O4
Mol. Mass.:
248.2744
SMILES:
CC1(CCc2ccc(O)cc2)CC(=O)CC(=O)O1
: