Target
Melanocortin receptor 4
Ligand
BDBM50191028
Substrate
Meas. Tech.
ChEMBL_397859 (CHEMBL856320)
Ki
20±n/a nM
Citation
 Chen, CWTran, JAJiang, WTucci, FCArellano, MWen, JFleck, BAMarinkovic, DWhite, NSPontillo, JSaunders, JMadan, AFoster, ACChen, C Propionylpiperazines as human melanocortin-4 receptor ligands. Bioorg Med Chem Lett 16:4800-3 (2006)  
Target
Name:
Melanocortin receptor 4
Synonyms:
MC4-R MC4R_HUMAN Melanocortin receptor 4 (MC-4) Melanocortin receptor 4 (MC4R)
Type:
Enzyme
Mol. Mass.:
36949.50
Organism:
Homo sapiens (Human)
Description:
P32245
Residue:
332
  
Inhibitor
Name:
BDBM50191028
Synonyms:
(R)-1-(4-(2-((S)-1-amino-3-methylbutyl)-4-methylphenyl)piperazin-1-yl)-3-(4-chloro-2-fluorophenyl)-2-methylpropan-1-one | CHEMBL386771
Type:
Small organic molecule
Emp. Form.:
C26H35ClFN3O
Mol. Mass.:
460.027
SMILES:
CC(C)C[C@H](N)c1cc(C)ccc1N1CCN(CC1)C(=O)[C@H](C)Cc1ccc(Cl)cc1F
: