Target
Imipenem-hydrolyzing beta-lactamase
Ligand
BDBM50191381
Substrate
Meas. Tech.
ChEMBL_365443 (CHEMBL869110)
IC50
27±n/a nM
Citation
 Venkatesan, AMAgarwal, AAbe, TUshirogochi, HYamamura, IAdo, MTsuyoshi, TDos Santos, OGu, YSum, FWLi, ZFrancisco, GLin, YIPetersen, PJYang, YKumagai, TWeiss, WJShlaes, DMKnox, JRMansour, TS Structure-activity relationship of 6-methylidene penems bearing 6,5 bicyclic heterocycles as broad-spectrum beta-lactamase inhibitors: evidence for 1,4-thiazepine intermediates with C7 R stereochemistry by computational methods. J Med Chem 49:4623-37 (2006)  
Target
Name:
Imipenem-hydrolyzing beta-lactamase
Synonyms:
BLAN_ENTCL | nmcA
Type:
PROTEIN
Mol. Mass.:
32077.29
Organism:
Enterobacter cloacae
Description:
ChEMBL_365443
Residue:
292
  
Inhibitor
Name:
BDBM50191381
Synonyms:
(5R,6Z)-6-{[5-(4-methoxybenzyl)-4,5,6,7-tetrahydrothieno[3,2-c]pyridin-2-yl)]methylene}-7-oxo-4-thia-1-azabicyclo[3.2.0]hept-2-ene-2-carboxylic acid sodium salt | CHEMBL378041
Type:
Small organic molecule
Emp. Form.:
C22H19N2O4S2
Mol. Mass.:
439.528
SMILES:
COc1ccc(CN2CCc3sc(\C=C4/[C@H]5SC=C(N5C4=O)C([O-])=O)cc3C2)cc1
: