Target
Imipenem-hydrolyzing beta-lactamase
Ligand
BDBM50191387
Substrate
Meas. Tech.
ChEMBL_365443 (CHEMBL869110)
IC50
22±n/a nM
Citation
 Venkatesan, AMAgarwal, AAbe, TUshirogochi, HYamamura, IAdo, MTsuyoshi, TDos Santos, OGu, YSum, FWLi, ZFrancisco, GLin, YIPetersen, PJYang, YKumagai, TWeiss, WJShlaes, DMKnox, JRMansour, TS Structure-activity relationship of 6-methylidene penems bearing 6,5 bicyclic heterocycles as broad-spectrum beta-lactamase inhibitors: evidence for 1,4-thiazepine intermediates with C7 R stereochemistry by computational methods. J Med Chem 49:4623-37 (2006)  
Target
Name:
Imipenem-hydrolyzing beta-lactamase
Synonyms:
BLAN_ENTCL | nmcA
Type:
PROTEIN
Mol. Mass.:
32077.29
Organism:
Enterobacter cloacae
Description:
ChEMBL_365443
Residue:
292
  
Inhibitor
Name:
BDBM50191387
Synonyms:
(5R),(6Z)-6-(7-methyl-5,6,7,8-tetrahydroimidazo[1,2-a]pyrazin-2-ylmethylene)-7-oxo-4-thia-1-aza-bicyclo-[3.2.0]hept-2-ene-2-carboxylic acid sodium salt | CHEMBL212478
Type:
Small organic molecule
Emp. Form.:
C14H13N4O3S
Mol. Mass.:
317.344
SMILES:
CN1CCn2cc(\C=C3/[C@H]4SC=C(N4C3=O)C([O-])=O)nc2C1
: