Target
Imipenem-hydrolyzing beta-lactamase
Ligand
BDBM50191389
Substrate
Meas. Tech.
ChEMBL_365443 (CHEMBL869110)
IC50
9±n/a nM
Citation
 Venkatesan, AMAgarwal, AAbe, TUshirogochi, HYamamura, IAdo, MTsuyoshi, TDos Santos, OGu, YSum, FWLi, ZFrancisco, GLin, YIPetersen, PJYang, YKumagai, TWeiss, WJShlaes, DMKnox, JRMansour, TS Structure-activity relationship of 6-methylidene penems bearing 6,5 bicyclic heterocycles as broad-spectrum beta-lactamase inhibitors: evidence for 1,4-thiazepine intermediates with C7 R stereochemistry by computational methods. J Med Chem 49:4623-37 (2006)  
Target
Name:
Imipenem-hydrolyzing beta-lactamase
Synonyms:
BLAN_ENTCL | nmcA
Type:
PROTEIN
Mol. Mass.:
32077.29
Organism:
Enterobacter cloacae
Description:
ChEMBL_365443
Residue:
292
  
Inhibitor
Name:
BDBM50191389
Synonyms:
6-(6,7-dihydro-4H-thieno[3,2-c]pyran-2-ylmethylene)-7-oxo-4-thia-1-aza-bicyclo[3.2.0]hept-2-ene-2-carboxylicacid sodium salt | CHEMBL380061
Type:
Small organic molecule
Emp. Form.:
C21H17N2O4S3
Mol. Mass.:
457.566
SMILES:
[O-]C(=O)C1=CS[C@H]2N1C(=O)\C2=C\c1cc2CN(CCc2s1)c1cc2COCCc2s1
: