Target
Imipenem-hydrolyzing beta-lactamase
Ligand
BDBM50191386
Substrate
Meas. Tech.
ChEMBL_365443 (CHEMBL869110)
IC50
90±n/a nM
Citation
 Venkatesan, AMAgarwal, AAbe, TUshirogochi, HYamamura, IAdo, MTsuyoshi, TDos Santos, OGu, YSum, FWLi, ZFrancisco, GLin, YIPetersen, PJYang, YKumagai, TWeiss, WJShlaes, DMKnox, JRMansour, TS Structure-activity relationship of 6-methylidene penems bearing 6,5 bicyclic heterocycles as broad-spectrum beta-lactamase inhibitors: evidence for 1,4-thiazepine intermediates with C7 R stereochemistry by computational methods. J Med Chem 49:4623-37 (2006)  
Target
Name:
Imipenem-hydrolyzing beta-lactamase
Synonyms:
BLAN_ENTCL | nmcA
Type:
PROTEIN
Mol. Mass.:
32077.29
Organism:
Enterobacter cloacae
Description:
ChEMBL_365443
Residue:
292
  
Inhibitor
Name:
BDBM50191386
Synonyms:
(5R)(6Z)-7-oxo-6-(4,5,6,7-tetrahydropyrazolo-[1,5-a]pyridin-2-ylmethylene)-4-thia-1-azabicyclo[3.2.0]hept-2-ene-2-carboxylic acid sodium salt | CHEMBL385593
Type:
Small organic molecule
Emp. Form.:
C14H12N3O3S
Mol. Mass.:
302.329
SMILES:
[O-]C(=O)C1=CS[C@H]2N1C(=O)\C2=C\c1cc2CCCCn2n1
: