Target
RNA-directed RNA polymerase
Ligand
BDBM50191525
Substrate
Meas. Tech.
ChEMBL_376990 (CHEMBL866684)
IC50
18±n/a nM
Citation
 Hirashima, SSuzuki, TIshida, TNoji, SYata, SAndo, IKomatsu, MIkeda, SHashimoto, H Benzimidazole derivatives bearing substituted biphenyls as hepatitis C virus NS5B RNA-dependent RNA polymerase inhibitors: structure-activity relationship studies and identification of a potent and highly selective inhibitor JTK-109. J Med Chem 49:4721-36 (2006)  
Target
Name:
RNA-directed RNA polymerase
Synonyms:
Hepatitis C virus NS5B RNA-dependent RNA polymerase | NS5B protein
Type:
Protein
Mol. Mass.:
25173.95
Organism:
Hepatitis C virus
Description:
Q8JXU8
Residue:
229
  
Inhibitor
Name:
BDBM50191525
Synonyms:
2-{4-[4'-chloro-4-(piperidine-1-carbonyl)biphenyl-2-ylmethoxy]-2-fluorophenyl}-1-cyclohexyl-1H-benzimidazole-5-carboxylic acid | CHEMBL411712
Type:
Small organic molecule
Emp. Form.:
C39H37ClFN3O4
Mol. Mass.:
666.18
SMILES:
OC(=O)c1ccc2n(C3CCCCC3)c(nc2c1)-c1ccc(OCc2cc(ccc2-c2ccc(Cl)cc2)C(=O)N2CCCCC2)cc1F
: