Target
RNA-directed RNA polymerase
Ligand
BDBM50191548
Substrate
Meas. Tech.
ChEMBL_376990 (CHEMBL866684)
IC50
21±n/a nM
Citation
 Hirashima, SSuzuki, TIshida, TNoji, SYata, SAndo, IKomatsu, MIkeda, SHashimoto, H Benzimidazole derivatives bearing substituted biphenyls as hepatitis C virus NS5B RNA-dependent RNA polymerase inhibitors: structure-activity relationship studies and identification of a potent and highly selective inhibitor JTK-109. J Med Chem 49:4721-36 (2006)  
Target
Name:
RNA-directed RNA polymerase
Synonyms:
Hepatitis C virus NS5B RNA-dependent RNA polymerase | NS5B protein
Type:
Protein
Mol. Mass.:
25173.95
Organism:
Hepatitis C virus
Description:
Q8JXU8
Residue:
229
  
Inhibitor
Name:
BDBM50191548
Synonyms:
2-{4-[4'-chloro-4-(2-hydroxyethylcarbamoyl)biphenyl-2-ylmethoxy]-2-fluorophenyl}-1-cyclohexyl-1H-benzimidazole-5-carboxylic acid | CHEMBL213807
Type:
Small organic molecule
Emp. Form.:
C36H33ClFN3O5
Mol. Mass.:
642.116
SMILES:
OCCNC(=O)c1ccc(c(COc2ccc(-c3nc4cc(ccc4n3C3CCCCC3)C(O)=O)c(F)c2)c1)-c1ccc(Cl)cc1
: