Target
Melanocortin receptor 4
Ligand
BDBM50034910
Substrate
Meas. Tech.
ChEMBL_376976 (CHEMBL871437)
EC50
59±n/a nM
Citation
 Tian, XField, TBSwitzer, AGMazur, AWEbetino, FHWos, JABerberich, SMJayasinghe, LRObringer, CMDowty, MEPinney, BBFarmer, JACrossdoersen, DSheldon, RJ Design, synthesis, and evaluation of proline and pyrrolidine based melanocortin receptor agonists. A conformationally restricted dipeptide mimic approach. J Med Chem 49:4745-61 (2006)  
Target
Name:
Melanocortin receptor 4
Synonyms:
MC4-R MC4R_HUMAN Melanocortin receptor 4 (MC-4) Melanocortin receptor 4 (MC4R)
Type:
Enzyme
Mol. Mass.:
36949.50
Organism:
Homo sapiens (Human)
Description:
P32245
Residue:
332
  
Inhibitor
Name:
BDBM50034910
Synonyms:
(S)-2-{(S)-2-[(S)-2-acetylamino-3-(3H-imidazol-4-yl)-propionylamino]-3-phenyl-propionylamino}-5-guanidino-pentanoic acid [(S)-1-carbamoyl-2-(1H-indol-3-yl)-ethyl]-amide 2-{2-[2-Acetylamino-3-(3H-imidazol-4-yl)-propionylamino]-3-phenyl-propionylamino}-5-guanidino-pentanoic acid [1-carbamoyl-2-(1H-indol-3-yl)-ethyl]-amide Ac-His-D-Phe-Arg-D-Trp-NH2 Ac-His-Phe-Arg-Trp-NH2 | CHEMBL50056
Type:
Small organic molecule
Emp. Form.:
C34H43N11O5
Mol. Mass.:
685.7759
SMILES:
CC(=O)N[C@@H](Cc1cnc[nH]1)C(=O)N[C@@H](Cc1ccccc1)C(=O)N[C@@H](CCCNC(N)=N)C(=O)N[C@@H](Cc1c[nH]c2ccccc12)C(N)=O
: