Target
Metallo-beta-lactamase L1 type 3
Ligand
BDBM50191999
Substrate
Meas. Tech.
ChEMBL_392530 (CHEMBL864291)
Ki
3670±n/a nM
Citation
 Sun, QLaw, ACrowder, MWGeysen, HM Homo-cysteinyl peptide inhibitors of the L1 metallo-beta-lactamase, and SAR as determined by combinatorial library synthesis. Bioorg Med Chem Lett 16:5169-75 (2006)  
Target
Name:
Metallo-beta-lactamase L1 type 3
Synonyms:
BLA1_STEMA | Beta-lactamase L1
Type:
PROTEIN
Mol. Mass.:
30803.13
Organism:
Stenotrophomonas maltophilia
Description:
ChEMBL_1500319
Residue:
290
  
Inhibitor
Name:
BDBM50191999
Synonyms:
(2R)-2-(2-(2-(4-bromophenyl)acetamido)-3-mercaptopropanamido)-3-phenylpropanoic acid | CHEMBL425101
Type:
Small organic molecule
Emp. Form.:
C20H21BrN2O4S
Mol. Mass.:
465.361
SMILES:
OC(=O)[C@@H](Cc1ccccc1)NC(=O)C(CS)NC(=O)Cc1ccc(Br)cc1
: