Target
Voltage-dependent T-type calcium channel subunit alpha-1G
Ligand
BDBM50192096
Substrate
Meas. Tech.
ChEMBL_394625 (CHEMBL910266)
IC50
1860±n/a nM
Citation
 Ku, IWCho, SDoddareddy, MRJang, MSKeum, GLee, JHChung, BYKim, YRhim, HKang, SB Morpholin-2-one derivatives as novel selective T-type Ca2+ channel blockers. Bioorg Med Chem Lett 16:5244-8 (2006)  
Target
Name:
Voltage-dependent T-type calcium channel subunit alpha-1G
Synonyms:
CAC1G_HUMAN KIAA1123 Voltage-gated T-type calcium channel alpha-1G subunit
Type:
PROTEIN
Mol. Mass.:
262471.14
Organism:
Homo sapiens (Human)
Description:
ChEMBL_1515216
Residue:
2377
  
Inhibitor
Name:
BDBM50192096
Synonyms:
CHEMBL215092 | cis-N-benzyl-5-(2-(methylthio)ethyl)-6-oxomorpholine-3-carboxamide
Type:
Small organic molecule
Emp. Form.:
C15H20N2O3S
Mol. Mass.:
308.396
SMILES:
CSCC[C@@H]1N[C@@H](COC1=O)C(=O)NCc1ccccc1
: