Target
Voltage-dependent T-type calcium channel subunit alpha-1G
Ligand
BDBM50192097
Substrate
Meas. Tech.
ChEMBL_394625 (CHEMBL910266)
IC50
1610±n/a nM
Citation
 Ku, IWCho, SDoddareddy, MRJang, MSKeum, GLee, JHChung, BYKim, YRhim, HKang, SB Morpholin-2-one derivatives as novel selective T-type Ca2+ channel blockers. Bioorg Med Chem Lett 16:5244-8 (2006)  
Target
Name:
Voltage-dependent T-type calcium channel subunit alpha-1G
Synonyms:
CAC1G_HUMAN KIAA1123 Voltage-gated T-type calcium channel alpha-1G subunit
Type:
PROTEIN
Mol. Mass.:
262471.14
Organism:
Homo sapiens (Human)
Description:
ChEMBL_1515216
Residue:
2377
  
Inhibitor
Name:
BDBM50192097
Synonyms:
CHEMBL215982 | cis-5-(4-chlorobenzyl)-6-oxo-N-((S)-1-phenylethyl)morpholine-3-carboxamide
Type:
Small organic molecule
Emp. Form.:
C20H21ClN2O3
Mol. Mass.:
372.845
SMILES:
C[C@H](NC(=O)[C@@H]1COC(=O)[C@H](Cc2ccc(Cl)cc2)N1)c1ccccc1
: