Target
Oxysterols receptor LXR-beta
Ligand
BDBM50192109
Substrate
Meas. Tech.
ChEMBL_406042 (CHEMBL912146)
EC50
20±n/a nM
Citation
 Panday, NBenz, JBlum-Kaelin, DBourgeaux, VDehmlow, HHartman, PKuhn, BRatni, HWarot, XWright, MB Synthesis and evaluation of anilinohexafluoroisopropanols as activators/modulators of LXRalpha and beta. Bioorg Med Chem Lett 16:5231-7 (2006)  
Target
Name:
Oxysterols receptor LXR-beta
Synonyms:
LXRB Liver X, LXR beta NR1H2 Nuclear receptor NER Ubiquitously-expressed nuclear receptor
Type:
Enzyme Catalytic Domain
Mol. Mass.:
50978.79
Organism:
Homo sapiens (Human)
Description:
P55055
Residue:
460
  
Inhibitor
Name:
BDBM50192109
Synonyms:
2-(4-(benzyl(2,2,2-trifluoroethyl)amino)-3-chlorophenyl)-1,1,1,3,3,3-hexafluoropropan-2-ol | CHEMBL384246
Type:
Small organic molecule
Emp. Form.:
C18H13ClF9NO
Mol. Mass.:
465.741
SMILES:
OC(c1ccc(N(Cc2ccccc2)CC(F)(F)F)c(Cl)c1)(C(F)(F)F)C(F)(F)F
: