Target
Oxysterols receptor LXR-alpha
Ligand
BDBM50192145
Substrate
Meas. Tech.
ChEMBL_406039 (CHEMBL912135)
IC50
60±n/a nM
Citation
 Panday, NBenz, JBlum-Kaelin, DBourgeaux, VDehmlow, HHartman, PKuhn, BRatni, HWarot, XWright, MB Synthesis and evaluation of anilinohexafluoroisopropanols as activators/modulators of LXRalpha and beta. Bioorg Med Chem Lett 16:5231-7 (2006)  
Target
Name:
Oxysterols receptor LXR-alpha
Synonyms:
LXRA Liver X receptor alpha Liver X receptor alpha (NR1H3) NR1H3 Nuclear orphan receptor LXR-alpha | Nuclear receptor subfamily 1 group H member 3
Type:
Enzyme Catalytic Domain
Mol. Mass.:
50403.85
Organism:
Homo sapiens (Human)
Description:
Q13133
Residue:
447
  
Inhibitor
Name:
BDBM50192145
Synonyms:
CHEMBL383945 | methyl 1-(4-(1,1,1,3,3,3-hexafluoro-2-hydroxypropan-2-yl)phenyl)-2-phenylpiperidine-2-carboxylate
Type:
Small organic molecule
Emp. Form.:
C22H21F6NO3
Mol. Mass.:
461.3975
SMILES:
COC(=O)C1(CCCCN1c1ccc(cc1)C(O)(C(F)(F)F)C(F)(F)F)c1ccccc1
: