Target
Oxysterols receptor LXR-beta
Ligand
BDBM50192145
Substrate
Meas. Tech.
ChEMBL_406042 (CHEMBL912146)
EC50
40±n/a nM
Citation
 Panday, NBenz, JBlum-Kaelin, DBourgeaux, VDehmlow, HHartman, PKuhn, BRatni, HWarot, XWright, MB Synthesis and evaluation of anilinohexafluoroisopropanols as activators/modulators of LXRalpha and beta. Bioorg Med Chem Lett 16:5231-7 (2006)  
Target
Name:
Oxysterols receptor LXR-beta
Synonyms:
LXRB Liver X, LXR beta NR1H2 Nuclear receptor NER Ubiquitously-expressed nuclear receptor
Type:
Enzyme Catalytic Domain
Mol. Mass.:
50978.79
Organism:
Homo sapiens (Human)
Description:
P55055
Residue:
460
  
Inhibitor
Name:
BDBM50192145
Synonyms:
CHEMBL383945 | methyl 1-(4-(1,1,1,3,3,3-hexafluoro-2-hydroxypropan-2-yl)phenyl)-2-phenylpiperidine-2-carboxylate
Type:
Small organic molecule
Emp. Form.:
C22H21F6NO3
Mol. Mass.:
461.3975
SMILES:
COC(=O)C1(CCCCN1c1ccc(cc1)C(O)(C(F)(F)F)C(F)(F)F)c1ccccc1
: