Target
Oxysterols receptor LXR-beta
Ligand
BDBM50192124
Substrate
Meas. Tech.
ChEMBL_406042 (CHEMBL912146)
EC50
200±n/a nM
Citation
 Panday, NBenz, JBlum-Kaelin, DBourgeaux, VDehmlow, HHartman, PKuhn, BRatni, HWarot, XWright, MB Synthesis and evaluation of anilinohexafluoroisopropanols as activators/modulators of LXRalpha and beta. Bioorg Med Chem Lett 16:5231-7 (2006)  
Target
Name:
Oxysterols receptor LXR-beta
Synonyms:
LXRB Liver X, LXR beta NR1H2 Nuclear receptor NER Ubiquitously-expressed nuclear receptor
Type:
Enzyme Catalytic Domain
Mol. Mass.:
50978.79
Organism:
Homo sapiens (Human)
Description:
P55055
Residue:
460
  
Inhibitor
Name:
BDBM50192124
Synonyms:
2-(3-chloro-4-(ethyl(2-hydroxy-1-phenylethyl)amino)phenyl)-1,1,1,3,3,3-hexafluoropropan-2-ol | CHEMBL214741
Type:
Small organic molecule
Emp. Form.:
C19H18ClF6NO2
Mol. Mass.:
441.795
SMILES:
CCN(C(CO)c1ccccc1)c1ccc(cc1Cl)C(O)(C(F)(F)F)C(F)(F)F
: