Target
Oxysterols receptor LXR-beta
Ligand
BDBM50192134
Substrate
Meas. Tech.
ChEMBL_406042 (CHEMBL912146)
EC50
80±n/a nM
Citation
 Panday, NBenz, JBlum-Kaelin, DBourgeaux, VDehmlow, HHartman, PKuhn, BRatni, HWarot, XWright, MB Synthesis and evaluation of anilinohexafluoroisopropanols as activators/modulators of LXRalpha and beta. Bioorg Med Chem Lett 16:5231-7 (2006)  
Target
Name:
Oxysterols receptor LXR-beta
Synonyms:
LXRB Liver X, LXR beta NR1H2 Nuclear receptor NER Ubiquitously-expressed nuclear receptor
Type:
Enzyme Catalytic Domain
Mol. Mass.:
50978.79
Organism:
Homo sapiens (Human)
Description:
P55055
Residue:
460
  
Inhibitor
Name:
BDBM50192134
Synonyms:
2-(4-(benzyl(ethyl)amino)-3-chlorophenyl)-1,1,1,3,3,3-hexafluoropropan-2-ol | CHEMBL215663
Type:
Small organic molecule
Emp. Form.:
C18H16ClF6NO
Mol. Mass.:
411.769
SMILES:
CCN(Cc1ccccc1)c1ccc(cc1Cl)C(O)(C(F)(F)F)C(F)(F)F
: