Target
Oxysterols receptor LXR-beta
Ligand
BDBM50192136
Substrate
Meas. Tech.
ChEMBL_406042 (CHEMBL912146)
EC50
60±n/a nM
Citation
 Panday, NBenz, JBlum-Kaelin, DBourgeaux, VDehmlow, HHartman, PKuhn, BRatni, HWarot, XWright, MB Synthesis and evaluation of anilinohexafluoroisopropanols as activators/modulators of LXRalpha and beta. Bioorg Med Chem Lett 16:5231-7 (2006)  
Target
Name:
Oxysterols receptor LXR-beta
Synonyms:
LXRB Liver X, LXR beta NR1H2 Nuclear receptor NER Ubiquitously-expressed nuclear receptor
Type:
Enzyme Catalytic Domain
Mol. Mass.:
50978.79
Organism:
Homo sapiens (Human)
Description:
P55055
Residue:
460
  
Inhibitor
Name:
BDBM50192136
Synonyms:
2-(4-(ethyl((5-methyl-2-(3-(trifluoromethyl)phenyl)oxazol-4-yl)methyl)amino)phenyl)-1,1,1,3,3,3-hexafluoropropan-2-ol | CHEMBL214867
Type:
Small organic molecule
Emp. Form.:
C23H19F9N2O2
Mol. Mass.:
526.3948
SMILES:
CCN(Cc1nc(oc1C)-c1cccc(c1)C(F)(F)F)c1ccc(cc1)C(O)(C(F)(F)F)C(F)(F)F
: