Target
Oxysterols receptor LXR-alpha
Ligand
BDBM50192149
Substrate
Meas. Tech.
ChEMBL_406039 (CHEMBL912135)
IC50
60±n/a nM
Citation
 Panday, NBenz, JBlum-Kaelin, DBourgeaux, VDehmlow, HHartman, PKuhn, BRatni, HWarot, XWright, MB Synthesis and evaluation of anilinohexafluoroisopropanols as activators/modulators of LXRalpha and beta. Bioorg Med Chem Lett 16:5231-7 (2006)  
Target
Name:
Oxysterols receptor LXR-alpha
Synonyms:
LXRA Liver X receptor alpha Liver X receptor alpha (NR1H3) NR1H3 Nuclear orphan receptor LXR-alpha | Nuclear receptor subfamily 1 group H member 3
Type:
Enzyme Catalytic Domain
Mol. Mass.:
50403.85
Organism:
Homo sapiens (Human)
Description:
Q13133
Residue:
447
  
Inhibitor
Name:
BDBM50192149
Synonyms:
CHEMBL215130 | methyl 4-(2-((2-chloro-4-(1,1,1,3,3,3-hexafluoro-2-hydroxypropan-2-yl)phenyl)(ethyl)amino)-2-phenylethoxy)benzoate
Type:
Small organic molecule
Emp. Form.:
C27H24ClF6NO4
Mol. Mass.:
575.927
SMILES:
CCN(C(COc1ccc(cc1)C(=O)OC)c1ccccc1)c1ccc(cc1Cl)C(O)(C(F)(F)F)C(F)(F)F
: