Target
Oxysterols receptor LXR-beta
Ligand
BDBM50192155
Substrate
Meas. Tech.
ChEMBL_406042 (CHEMBL912146)
EC50
300±n/a nM
Citation
 Panday, NBenz, JBlum-Kaelin, DBourgeaux, VDehmlow, HHartman, PKuhn, BRatni, HWarot, XWright, MB Synthesis and evaluation of anilinohexafluoroisopropanols as activators/modulators of LXRalpha and beta. Bioorg Med Chem Lett 16:5231-7 (2006)  
Target
Name:
Oxysterols receptor LXR-beta
Synonyms:
LXRB Liver X, LXR beta NR1H2 Nuclear receptor NER Ubiquitously-expressed nuclear receptor
Type:
Enzyme Catalytic Domain
Mol. Mass.:
50978.79
Organism:
Homo sapiens (Human)
Description:
P55055
Residue:
460
  
Inhibitor
Name:
BDBM50192155
Synonyms:
2-(4-(ethyl(pyridin-2-ylmethyl)amino)phenyl)-1,1,1,3,3,3-hexafluoropropan-2-ol | CHEMBL214727
Type:
Small organic molecule
Emp. Form.:
C17H16F6N2O
Mol. Mass.:
378.3122
SMILES:
CCN(Cc1ccccn1)c1ccc(cc1)C(O)(C(F)(F)F)C(F)(F)F
: