Target
Oxysterols receptor LXR-beta
Ligand
BDBM50192152
Substrate
Meas. Tech.
ChEMBL_406042 (CHEMBL912146)
EC50
2400±n/a nM
Citation
 Panday, NBenz, JBlum-Kaelin, DBourgeaux, VDehmlow, HHartman, PKuhn, BRatni, HWarot, XWright, MB Synthesis and evaluation of anilinohexafluoroisopropanols as activators/modulators of LXRalpha and beta. Bioorg Med Chem Lett 16:5231-7 (2006)  
Target
Name:
Oxysterols receptor LXR-beta
Synonyms:
LXRB Liver X, LXR beta NR1H2 Nuclear receptor NER Ubiquitously-expressed nuclear receptor
Type:
Enzyme Catalytic Domain
Mol. Mass.:
50978.79
Organism:
Homo sapiens (Human)
Description:
P55055
Residue:
460
  
Inhibitor
Name:
BDBM50192152
Synonyms:
2-(4-(2-((2-chloro-4-(1,1,1,3,3,3-hexafluoro-2-hydroxypropan-2-yl)phenyl)(ethyl)amino)-2-phenylethoxy)phenyl)acetic acid | CHEMBL214546
Type:
Small organic molecule
Emp. Form.:
C27H24ClF6NO4
Mol. Mass.:
575.927
SMILES:
CCN(C(COc1ccc(CC(O)=O)cc1)c1ccccc1)c1ccc(cc1Cl)C(O)(C(F)(F)F)C(F)(F)F
: