Target
Oxysterols receptor LXR-beta
Ligand
BDBM50192122
Substrate
Meas. Tech.
ChEMBL_406042 (CHEMBL912146)
EC50
2300±n/a nM
Citation
 Panday, NBenz, JBlum-Kaelin, DBourgeaux, VDehmlow, HHartman, PKuhn, BRatni, HWarot, XWright, MB Synthesis and evaluation of anilinohexafluoroisopropanols as activators/modulators of LXRalpha and beta. Bioorg Med Chem Lett 16:5231-7 (2006)  
Target
Name:
Oxysterols receptor LXR-beta
Synonyms:
LXRB Liver X, LXR beta NR1H2 Nuclear receptor NER Ubiquitously-expressed nuclear receptor
Type:
Enzyme Catalytic Domain
Mol. Mass.:
50978.79
Organism:
Homo sapiens (Human)
Description:
P55055
Residue:
460
  
Inhibitor
Name:
BDBM50192122
Synonyms:
2-(ethyl(4-(1,1,1,3,3,3-hexafluoro-2-hydroxypropan-2-yl)phenyl)amino)-N,N-dimethyl-2-phenylacetamide | CHEMBL215775
Type:
Small organic molecule
Emp. Form.:
C21H22F6N2O2
Mol. Mass.:
448.402
SMILES:
CCN(C(C(=O)N(C)C)c1ccccc1)c1ccc(cc1)C(O)(C(F)(F)F)C(F)(F)F
: