Target
Oxysterols receptor LXR-beta
Ligand
BDBM50192123
Substrate
Meas. Tech.
ChEMBL_406042 (CHEMBL912146)
EC50
100±n/a nM
Citation
 Panday, NBenz, JBlum-Kaelin, DBourgeaux, VDehmlow, HHartman, PKuhn, BRatni, HWarot, XWright, MB Synthesis and evaluation of anilinohexafluoroisopropanols as activators/modulators of LXRalpha and beta. Bioorg Med Chem Lett 16:5231-7 (2006)  
Target
Name:
Oxysterols receptor LXR-beta
Synonyms:
LXRB Liver X, LXR beta NR1H2 Nuclear receptor NER Ubiquitously-expressed nuclear receptor
Type:
Enzyme Catalytic Domain
Mol. Mass.:
50978.79
Organism:
Homo sapiens (Human)
Description:
P55055
Residue:
460
  
Inhibitor
Name:
BDBM50192123
Synonyms:
2-(4-(ethyl(2-methoxy-1-phenylethyl)amino)phenyl)-1,1,1,3,3,3-hexafluoropropan-2-ol | CHEMBL215598
Type:
Small organic molecule
Emp. Form.:
C20H21F6NO2
Mol. Mass.:
421.3767
SMILES:
CCN(C(COC)c1ccccc1)c1ccc(cc1)C(O)(C(F)(F)F)C(F)(F)F
: