Target
Oxysterols receptor LXR-alpha
Ligand
BDBM50192113
Substrate
Meas. Tech.
ChEMBL_406039 (CHEMBL912135)
IC50
6±n/a nM
Citation
 Panday, NBenz, JBlum-Kaelin, DBourgeaux, VDehmlow, HHartman, PKuhn, BRatni, HWarot, XWright, MB Synthesis and evaluation of anilinohexafluoroisopropanols as activators/modulators of LXRalpha and beta. Bioorg Med Chem Lett 16:5231-7 (2006)  
Target
Name:
Oxysterols receptor LXR-alpha
Synonyms:
LXRA Liver X receptor alpha Liver X receptor alpha (NR1H3) NR1H3 Nuclear orphan receptor LXR-alpha | Nuclear receptor subfamily 1 group H member 3
Type:
Enzyme Catalytic Domain
Mol. Mass.:
50403.85
Organism:
Homo sapiens (Human)
Description:
Q13133
Residue:
447
  
Inhibitor
Name:
BDBM50192113
Synonyms:
2-(3-chloro-4-(ethyl((5-methyl-2-(3-(trifluoromethyl)phenyl)oxazol-4-yl)methyl)amino)phenyl)-1,1,1,3,3,3-hexafluoropropan-2-ol | CHEMBL383944
Type:
Small organic molecule
Emp. Form.:
C23H18ClF9N2O2
Mol. Mass.:
560.84
SMILES:
CCN(Cc1nc(oc1C)-c1cccc(c1)C(F)(F)F)c1ccc(cc1Cl)C(O)(C(F)(F)F)C(F)(F)F
: