Target
Oxysterols receptor LXR-alpha
Ligand
BDBM50192117
Substrate
Meas. Tech.
ChEMBL_406039 (CHEMBL912135)
IC50
5±n/a nM
Citation
 Panday, NBenz, JBlum-Kaelin, DBourgeaux, VDehmlow, HHartman, PKuhn, BRatni, HWarot, XWright, MB Synthesis and evaluation of anilinohexafluoroisopropanols as activators/modulators of LXRalpha and beta. Bioorg Med Chem Lett 16:5231-7 (2006)  
Target
Name:
Oxysterols receptor LXR-alpha
Synonyms:
LXRA Liver X receptor alpha Liver X receptor alpha (NR1H3) NR1H3 Nuclear orphan receptor LXR-alpha | Nuclear receptor subfamily 1 group H member 3
Type:
Enzyme Catalytic Domain
Mol. Mass.:
50403.85
Organism:
Homo sapiens (Human)
Description:
Q13133
Residue:
447
  
Inhibitor
Name:
BDBM50192117
Synonyms:
2-(4-(((2-(3-chlorophenyl)-5-methyloxazol-4-yl)methyl)(methyl)amino)phenyl)-1,1,1,3,3,3-hexafluoropropan-2-ol | CHEMBL215789
Type:
Small organic molecule
Emp. Form.:
C22H19ClF6N2O2
Mol. Mass.:
492.842
SMILES:
CCN(Cc1nc(oc1C)-c1cccc(Cl)c1)c1ccc(cc1)C(O)(C(F)(F)F)C(F)(F)F
: