Target
Histamine H3 receptor
Ligand
BDBM50193171
Substrate
Meas. Tech.
ChEMBL_422153 (CHEMBL713681)
Ki
15±n/a nM
Citation
 Lau, JFJeppesen, CBRimvall, KHohlweg, R Ureas with histamine H3-antagonist receptor activity--a new scaffold discovered by lead-hopping from cinnamic acid amides. Bioorg Med Chem Lett 16:5303-8 (2006)  
Target
Name:
Histamine H3 receptor
Synonyms:
G-protein coupled receptor 97 HH3R HRH3 Histamine H3 receptor (H3) Histamine receptor (H3 and H4)
Type:
G Protein-Coupled Receptor (GPCR)
Mol. Mass.:
48691.47
Organism:
Homo sapiens (Human)
Description:
Binding assays were using CHO cells stably expressing hH3R receptors.
Residue:
445
  
Inhibitor
Name:
BDBM50193171
Synonyms:
CHEMBL218984 | N-(3,4-dichlorobenzyl)-4-cyclopentylpiperazine-1-carboxamide
Type:
Small organic molecule
Emp. Form.:
C17H23Cl2N3O
Mol. Mass.:
356.29
SMILES:
Clc1ccc(CNC(=O)N2CCN(CC2)C2CCCC2)cc1Cl
: