Target
Cytochrome P450 2D6
Ligand
BDBM50193172
Substrate
Meas. Tech.
ChEMBL_422157 (CHEMBL863594)
IC50
7000±n/a nM
Citation
 Lau, JFJeppesen, CBRimvall, KHohlweg, R Ureas with histamine H3-antagonist receptor activity--a new scaffold discovered by lead-hopping from cinnamic acid amides. Bioorg Med Chem Lett 16:5303-8 (2006)  
Target
Name:
Cytochrome P450 2D6
Synonyms:
CP2D6_HUMAN CYP2DL1 Cytochrome P450 2D6 (CYP2D6) P450-DB1
Type:
Protein
Mol. Mass.:
55774.82
Organism:
Homo sapiens (Human)
Description:
P10635
Residue:
497
  
Inhibitor
Name:
BDBM50193172
Synonyms:
(4-tert-butylpiperidin-1-yl)(4-isopropylpiperazin-1-yl)methanone | CHEMBL219128
Type:
Small organic molecule
Emp. Form.:
C17H33N3O
Mol. Mass.:
295.4634
SMILES:
CC(C)N1CCN(CC1)C(=O)N1CCC(CC1)C(C)(C)C
: