Target
Histamine H3 receptor
Ligand
BDBM50193176
Substrate
Meas. Tech.
ChEMBL_422153 (CHEMBL713681)
Ki
44±n/a nM
Citation
 Lau, JFJeppesen, CBRimvall, KHohlweg, R Ureas with histamine H3-antagonist receptor activity--a new scaffold discovered by lead-hopping from cinnamic acid amides. Bioorg Med Chem Lett 16:5303-8 (2006)  
Target
Name:
Histamine H3 receptor
Synonyms:
G-protein coupled receptor 97 HH3R HRH3 Histamine H3 receptor (H3) Histamine receptor (H3 and H4)
Type:
G Protein-Coupled Receptor (GPCR)
Mol. Mass.:
48691.47
Organism:
Homo sapiens (Human)
Description:
Binding assays were using CHO cells stably expressing hH3R receptors.
Residue:
445
  
Inhibitor
Name:
BDBM50193176
Synonyms:
CHEMBL373540 | N-(2,3-dihydro-1H-inden-2-yl)-4-ethylpiperazine-1-carboxamide
Type:
Small organic molecule
Emp. Form.:
C16H23N3O
Mol. Mass.:
273.3733
SMILES:
CCN1CCN(CC1)C(=O)NC1Cc2ccccc2C1
: