Target
Histamine H3 receptor
Ligand
BDBM50193180
Substrate
Meas. Tech.
ChEMBL_422153 (CHEMBL713681)
Ki
17±n/a nM
Citation
 Lau, JFJeppesen, CBRimvall, KHohlweg, R Ureas with histamine H3-antagonist receptor activity--a new scaffold discovered by lead-hopping from cinnamic acid amides. Bioorg Med Chem Lett 16:5303-8 (2006)  
Target
Name:
Histamine H3 receptor
Synonyms:
G-protein coupled receptor 97 HH3R HRH3 Histamine H3 receptor (H3) Histamine receptor (H3 and H4)
Type:
G Protein-Coupled Receptor (GPCR)
Mol. Mass.:
48691.47
Organism:
Homo sapiens (Human)
Description:
Binding assays were using CHO cells stably expressing hH3R receptors.
Residue:
445
  
Inhibitor
Name:
BDBM50193180
Synonyms:
CHEMBL220407 | N-(1-(1-isopropylpiperazine-4-carbonyl)piperidin-4-yl)cyclopentanecarboxamide
Type:
Small organic molecule
Emp. Form.:
C19H34N4O2
Mol. Mass.:
350.4989
SMILES:
CC(C)N1CCN(CC1)C(=O)N1CCC(CC1)NC(=O)C1CCCC1
: