Target
Histamine H3 receptor
Ligand
BDBM50193197
Substrate
Meas. Tech.
ChEMBL_422153 (CHEMBL713681)
Ki
27±n/a nM
Citation
 Lau, JFJeppesen, CBRimvall, KHohlweg, R Ureas with histamine H3-antagonist receptor activity--a new scaffold discovered by lead-hopping from cinnamic acid amides. Bioorg Med Chem Lett 16:5303-8 (2006)  
Target
Name:
Histamine H3 receptor
Synonyms:
G-protein coupled receptor 97 HH3R HRH3 Histamine H3 receptor (H3) Histamine receptor (H3 and H4)
Type:
G Protein-Coupled Receptor (GPCR)
Mol. Mass.:
48691.47
Organism:
Homo sapiens (Human)
Description:
Binding assays were using CHO cells stably expressing hH3R receptors.
Residue:
445
  
Inhibitor
Name:
BDBM50193197
Synonyms:
(4-isopropylpiperazin-1-yl)(4-phenyl-5,6-dihydropyridin-1(2H)-yl)methanone | CHEMBL375571
Type:
Small organic molecule
Emp. Form.:
C19H27N3O
Mol. Mass.:
313.4372
SMILES:
CC(C)N1CCN(CC1)C(=O)N1CCC(=CC1)c1ccccc1
: