Target
Histamine H3 receptor
Ligand
BDBM50193200
Substrate
Meas. Tech.
ChEMBL_422153 (CHEMBL713681)
Ki
94±n/a nM
Citation
 Lau, JFJeppesen, CBRimvall, KHohlweg, R Ureas with histamine H3-antagonist receptor activity--a new scaffold discovered by lead-hopping from cinnamic acid amides. Bioorg Med Chem Lett 16:5303-8 (2006)  
Target
Name:
Histamine H3 receptor
Synonyms:
G-protein coupled receptor 97 HH3R HRH3 Histamine H3 receptor (H3) Histamine receptor (H3 and H4)
Type:
G Protein-Coupled Receptor (GPCR)
Mol. Mass.:
48691.47
Organism:
Homo sapiens (Human)
Description:
Binding assays were using CHO cells stably expressing hH3R receptors.
Residue:
445
  
Inhibitor
Name:
BDBM50193200
Synonyms:
(S)-isoindolin-2-yl(2-(pyrrolidin-1-ylmethyl)pyrrolidin-1-yl)methanone | CHEMBL384427
Type:
Small organic molecule
Emp. Form.:
C18H25N3O
Mol. Mass.:
299.4106
SMILES:
O=C(N1Cc2ccccc2C1)N1CCC[C@H]1CN1CCCC1
: