Target
Histamine H3 receptor
Ligand
BDBM50193212
Substrate
Meas. Tech.
ChEMBL_422153 (CHEMBL713681)
Ki
78±n/a nM
Citation
 Lau, JFJeppesen, CBRimvall, KHohlweg, R Ureas with histamine H3-antagonist receptor activity--a new scaffold discovered by lead-hopping from cinnamic acid amides. Bioorg Med Chem Lett 16:5303-8 (2006)  
Target
Name:
Histamine H3 receptor
Synonyms:
G-protein coupled receptor 97 HH3R HRH3 Histamine H3 receptor (H3) Histamine receptor (H3 and H4)
Type:
G Protein-Coupled Receptor (GPCR)
Mol. Mass.:
48691.47
Organism:
Homo sapiens (Human)
Description:
Binding assays were using CHO cells stably expressing hH3R receptors.
Residue:
445
  
Inhibitor
Name:
BDBM50193212
Synonyms:
(S)-N-(3-(aminomethyl)benzyl)-2-(pyrrolidin-1-ylmethyl)pyrrolidine-1-carboxamide | CHEMBL376019
Type:
Small organic molecule
Emp. Form.:
C18H28N4O
Mol. Mass.:
316.4411
SMILES:
NCc1cccc(CNC(=O)N2CCC[C@H]2CN2CCCC2)c1
: