Target
Cytochrome P450 1A2
Ligand
BDBM50193189
Substrate
Meas. Tech.
ChEMBL_422155 (CHEMBL863592)
IC50
>25000±n/a nM
Citation
 Lau, JFJeppesen, CBRimvall, KHohlweg, R Ureas with histamine H3-antagonist receptor activity--a new scaffold discovered by lead-hopping from cinnamic acid amides. Bioorg Med Chem Lett 16:5303-8 (2006)  
Target
Name:
Cytochrome P450 1A2
Synonyms:
CP1A2_HUMAN CYPIA2 Cytochrome P(3)450 Cytochrome P450 1A2 (CYP1A2) Cytochrome P450-P3
Type:
Enzyme
Mol. Mass.:
58423.38
Organism:
Homo sapiens (Human)
Description:
P05177
Residue:
516
  
Inhibitor
Name:
BDBM50193189
Synonyms:
CHEMBL218834 | [4-(3-Aza-bicyclo[3.2.2]nonane-3-carbonyl)-piperidin-1-yl]-(4-isopropyl-piperazin-1-yl)-methanone
Type:
Small organic molecule
Emp. Form.:
C22H38N4O2
Mol. Mass.:
390.5627
SMILES:
CC(C)N1CCN(CC1)C(=O)N1CCC(CC1)C(=O)N1CC2CCC(CC2)C1
: